Reaction Details
TargetDelta-type opioid receptor
LigandBDBM50180188
Substrate/Competitorn/a
Meas. Tech.ChEMBL_330098 (CHEMBL858980)
Ki 190±n/a nM
Citation Peng, XKnapp, BIBidlack, JMNeumeyer, JL Synthesis and preliminary in vitro investigation of bivalent ligands containing homo- and heterodimeric pharmacophores at mu, delta, and kappa opioid receptors. J Med Chem49:256-62 (2006) 
 
Delta-type opioid receptor
Name:Delta-type opioid receptor
Type:G Protein-Coupled Receptor (GPCR)
Mol. Mass.:40382.98
Organism:Homo sapiens (Human)
Description:Competition binding assays were carried out using membrane preparations from transfected HN9.10 cells that constitutively expressed the delta opioid receptor.
Residue:372
BDBM50180188
NameBDBM50180188
Synonyms:CHEMBL372823 | bis-((-)-N-propargylmorphinan-3-yl) sebacoylate
TypeSmall organic molecule
Emp. Form.C48H60N2O4
Mol. Mass.729.001
SMILESO=C(CCCCCCCCC(=O)Oc1ccc2C[C@@H]3C4CCCC[C@]4(CCN3CC#C)c2c1)Oc1ccc2C[C@@H]3C4CCCC[C@]4(CCN3CC#C)c2c1