Reaction Details
TargetMu-type opioid receptor
LigandBDBM50180189
Substrate/Competitorn/a
Meas. Tech.ChEMBL_330105 (CHEMBL863310)
EC50 4.4±n/a nM
Citation Peng, XKnapp, BIBidlack, JMNeumeyer, JL Synthesis and preliminary in vitro investigation of bivalent ligands containing homo- and heterodimeric pharmacophores at mu, delta, and kappa opioid receptors. J Med Chem49:256-62 (2006) 
 
Mu-type opioid receptor
Name:Mu-type opioid receptor
Type:G Protein-Coupled Receptor (GPCR)
Mol. Mass.:44789.51
Organism:Homo sapiens (Human)
Description:P35372
Residue:400
BDBM50180189
NameBDBM50180189
Synonyms:1-((-)-N-cyclobutylmethylmorphinan-3-yl) 10-((-)-N-cyclobutylmethylmorphinan-3-yl) sebacoylate | CHEMBL200881
TypeSmall organic molecule
Emp. Form.C52H73N3O3
Mol. Mass.788.1543
SMILESO=C(CCCCCCCCC(=O)Oc1ccc2C[C@@H]3C4CCCC[C@]4(CCN3CC3CCC3)c2c1)Nc1ccc2C[C@@H]3C4CCCC[C@]4(CCN3CC3CCC3)c2c1