Reaction Details
TargetKappa-type opioid receptor
LigandBDBM50180189
Substrate/Competitorn/a
Meas. Tech.ChEMBL_330099 (CHEMBL858981)
Ki 0.380000±n/a nM
Citation Peng, XKnapp, BIBidlack, JMNeumeyer, JL Synthesis and preliminary in vitro investigation of bivalent ligands containing homo- and heterodimeric pharmacophores at mu, delta, and kappa opioid receptors. J Med Chem49:256-62 (2006) 
 
Kappa-type opioid receptor
Name:Kappa-type opioid receptor
Type:G Protein-Coupled Receptor (GPCR)
Mol. Mass.:42648.76
Organism:Homo sapiens (Human)
Description:P41145
Residue:380
BDBM50180189
NameBDBM50180189
Synonyms:1-((-)-N-cyclobutylmethylmorphinan-3-yl) 10-((-)-N-cyclobutylmethylmorphinan-3-yl) sebacoylate | CHEMBL200881
TypeSmall organic molecule
Emp. Form.C52H73N3O3
Mol. Mass.788.1543
SMILESO=C(CCCCCCCCC(=O)Oc1ccc2C[C@@H]3C4CCCC[C@]4(CCN3CC3CCC3)c2c1)Nc1ccc2C[C@@H]3C4CCCC[C@]4(CCN3CC3CCC3)c2c1