Reaction Details
TargetMu-type opioid receptor
LigandBDBM50180179
Substrate/Competitorn/a
Meas. Tech.ChEMBL_330097 (CHEMBL858889)
Ki 0.160000±n/a nM
Citation Peng, XKnapp, BIBidlack, JMNeumeyer, JL Synthesis and preliminary in vitro investigation of bivalent ligands containing homo- and heterodimeric pharmacophores at mu, delta, and kappa opioid receptors. J Med Chem49:256-62 (2006) 
 
Mu-type opioid receptor
Name:Mu-type opioid receptor
Type:G Protein-Coupled Receptor (GPCR)
Mol. Mass.:44789.51
Organism:Homo sapiens (Human)
Description:P35372
Residue:400
BDBM50180179
NameBDBM50180179
Synonyms:CHEMBL203251 | MCL-139
TypeSmall organic molecule
Emp. Form.C46H60N2O4
Mol. Mass.704.9796
SMILESO=C(CCC(=O)Oc1ccc2C[C@@H]3C4CCCC[C@]4(CCN3CC3CCC3)c2c1)Oc1ccc2C[C@@H]3C4CCCC[C@]4(CCN3CC3CCC3)c2c1