Reaction Details
TargetKappa-type opioid receptor
LigandBDBM50180190
Substrate/Competitorn/a
Meas. Tech.ChEMBL_330099 (CHEMBL858981)
Ki 0.150000±n/a nM
Citation Peng, XKnapp, BIBidlack, JMNeumeyer, JL Synthesis and preliminary in vitro investigation of bivalent ligands containing homo- and heterodimeric pharmacophores at mu, delta, and kappa opioid receptors. J Med Chem49:256-62 (2006) 
 
Kappa-type opioid receptor
Name:Kappa-type opioid receptor
Type:G Protein-Coupled Receptor (GPCR)
Mol. Mass.:42648.76
Organism:Homo sapiens (Human)
Description:P41145
Residue:380
BDBM50180190
NameBDBM50180190
Synonyms:(1R,9R)-17-[(2S)-oxolan-2-ylmethyl]-17-azatetracyclo[7.5.3.0^{1,10}.0^{2,7}]heptadeca-2(7),3,5-trien-4-ol | CHEMBL199832
TypeSmall organic molecule
Emp. Form.C21H29NO2
Mol. Mass.327.4605
SMILESOc1ccc2C[C@@H]3C4CCCC[C@]4(CCN3C[C@@H]3CCCO3)c2c1