Reaction Details
TargetKappa-type opioid receptor
LigandBDBM50366764
Substrate/Competitorn/a
Meas. Tech.ChEMBL_330099 (CHEMBL858981)
Ki 0.003000±n/a nM
Citation Peng, XKnapp, BIBidlack, JMNeumeyer, JL Synthesis and preliminary in vitro investigation of bivalent ligands containing homo- and heterodimeric pharmacophores at mu, delta, and kappa opioid receptors. J Med Chem49:256-62 (2006) 
 
Kappa-type opioid receptor
Name:Kappa-type opioid receptor
Type:G Protein-Coupled Receptor (GPCR)
Mol. Mass.:42648.76
Organism:Homo sapiens (Human)
Description:P41145
Residue:380
BDBM50366764
NameBDBM50366764
Synonyms:CHEMBL1790045 | MCL-117
TypeSmall organic molecule
Emp. Form.C19H23NO
Mol. Mass.281.392
SMILESOc1ccc2C[C@@H]3[C@@H]4CCCC[C@]4(CCN3CC#C)c2c1