Reaction Details
TargetKappa-type opioid receptor
LigandBDBM50180183
Substrate/Competitorn/a
Meas. Tech.ChEMBL_330099 (CHEMBL858981)
EC50 2.5±n/a nM
Citation Peng, XKnapp, BIBidlack, JMNeumeyer, JL Synthesis and preliminary in vitro investigation of bivalent ligands containing homo- and heterodimeric pharmacophores at mu, delta, and kappa opioid receptors. J Med Chem49:256-62 (2006) 
 
Kappa-type opioid receptor
Name:Kappa-type opioid receptor
Type:G Protein-Coupled Receptor (GPCR)
Mol. Mass.:42648.76
Organism:Homo sapiens (Human)
Description:P41145
Residue:380
BDBM50180183
NameBDBM50180183
Synonyms:1-((-)-N-cyclopropylmethylmorphinan-3-yl) 10-(N-cyclobutylmethylmorphinan-3-yl) sebacoylate | CHEMBL201271
TypeSmall organic molecule
Emp. Form.C51H70N2O4
Mol. Mass.775.1125
SMILESO=C(CCCCCCCCC(=O)Oc1ccc2C[C@@H]3C4CCCC[C@]4(CCN3CC3CCC3)c2c1)Oc1ccc2C[C@@H]3C4CCCC[C@]4(CCN3CC3CC3)c2c1