Reaction Details
TargetMu-type opioid receptor
LigandBDBM50180182
Substrate/Competitorn/a
Meas. Tech.ChEMBL_330105 (CHEMBL863310)
EC50 12±n/a nM
Citation Peng, XKnapp, BIBidlack, JMNeumeyer, JL Synthesis and preliminary in vitro investigation of bivalent ligands containing homo- and heterodimeric pharmacophores at mu, delta, and kappa opioid receptors. J Med Chem49:256-62 (2006) 
 
Mu-type opioid receptor
Name:Mu-type opioid receptor
Type:G Protein-Coupled Receptor (GPCR)
Mol. Mass.:44789.51
Organism:Homo sapiens (Human)
Description:P35372
Residue:400
BDBM50180182
NameBDBM50180182
Synonyms:CHEMBL369919 | bis-((-)-N-[(S)-tetrahydrofurfuryl]morphinan-3-yl) sebacoylate
TypeSmall organic molecule
Emp. Form.C52H72N2O6
Mol. Mass.821.1379
SMILESO=C(CCCCCCCCC(=O)Oc1ccc2C[C@@H]3C4CCCC[C@]4(CCN3C[C@@H]3CCCO3)c2c1)Oc1ccc2C[C@@H]3C4CCCC[C@]4(CCN3C[C@@H]3CCCO3)c2c1