Reaction Details
TargetKappa-type opioid receptor
LigandBDBM50105483
Substrate/Competitorn/a
Meas. Tech.ChEMBL_330099 (CHEMBL858981)
EC50 0.190000±n/a nM
Citation Peng, XKnapp, BIBidlack, JMNeumeyer, JL Synthesis and preliminary in vitro investigation of bivalent ligands containing homo- and heterodimeric pharmacophores at mu, delta, and kappa opioid receptors. J Med Chem49:256-62 (2006) 
 
Kappa-type opioid receptor
Name:Kappa-type opioid receptor
Type:G Protein-Coupled Receptor (GPCR)
Mol. Mass.:42648.76
Organism:Homo sapiens (Human)
Description:P41145
Residue:380
BDBM50105483
NameBDBM50105483
Synonyms:(-)-cyclorphan 17-cyclopropylmethyl-(9R)-17-azatetracyclo[7.5.3.01,10.02,7]heptadeca-2(7),3,5-trien-4-ol CHEMBL291468
TypeSmall organic molecule
Emp. Form.C20H27NO
Mol. Mass.297.4345
SMILESOc1ccc2C[C@@H]3C4CCCC[C@]4(CCN3CC3CC3)c2c1