Reaction Details
TargetKappa-type opioid receptor
LigandBDBM50180179
Substrate/Competitorn/a
Meas. Tech.ChEMBL_330099 (CHEMBL858981)
Ki 0.076000±n/a nM
Citation Peng, XKnapp, BIBidlack, JMNeumeyer, JL Synthesis and preliminary in vitro investigation of bivalent ligands containing homo- and heterodimeric pharmacophores at mu, delta, and kappa opioid receptors. J Med Chem49:256-62 (2006) 
 
Kappa-type opioid receptor
Name:Kappa-type opioid receptor
Type:G Protein-Coupled Receptor (GPCR)
Mol. Mass.:42648.76
Organism:Homo sapiens (Human)
Description:P41145
Residue:380
BDBM50180179
NameBDBM50180179
Synonyms:CHEMBL203251 | MCL-139
TypeSmall organic molecule
Emp. Form.C46H60N2O4
Mol. Mass.704.9796
SMILESO=C(CCC(=O)Oc1ccc2C[C@@H]3C4CCCC[C@]4(CCN3CC3CCC3)c2c1)Oc1ccc2C[C@@H]3C4CCCC[C@]4(CCN3CC3CCC3)c2c1