Reaction Details
TargetMu-type opioid receptor
LigandBDBM50180194
Substrate/Competitorn/a
Meas. Tech.ChEMBL_330097 (CHEMBL858889)
Ki 60±n/a nM
Citation Peng, XKnapp, BIBidlack, JMNeumeyer, JL Synthesis and preliminary in vitro investigation of bivalent ligands containing homo- and heterodimeric pharmacophores at mu, delta, and kappa opioid receptors. J Med Chem49:256-62 (2006) 
 
Mu-type opioid receptor
Name:Mu-type opioid receptor
Type:G Protein-Coupled Receptor (GPCR)
Mol. Mass.:44789.51
Organism:Homo sapiens (Human)
Description:P35372
Residue:400
BDBM50180194
NameBDBM50180194
Synonyms:(+)-3-hydroxy-N-cyclobutylmethylmorphinan mandelate | CHEMBL381117
TypeSmall organic molecule
Emp. Form.C21H29NO
Mol. Mass.311.4611
SMILESOc1ccc2C[C@H]3C4CCCC[C@@]4(CCN3CC3CCC3)c2c1