Reaction Details
TargetCannabinoid receptor 1
LigandBDBM50181457
Substrate/Competitorn/a
Meas. Tech.ChEMBL_330571 (CHEMBL871146)
Ki 7033±n/a nM
Citation Muccioli, GGWouters, JCharlier, CScriba, GKPizza, TDi Pace, PDe Martino, PPoppitz, WPoupaert, JHLambert, DM Synthesis and activity of 1,3,5-triphenylimidazolidine-2,4-diones and 1,3,5-triphenyl-2-thioxoimidazolidin-4-ones: characterization of new CB1 cannabinoid receptor inverse agonists/antagonists. J Med Chem49:872-82 (2006) 
 
Cannabinoid receptor 1
Name:Cannabinoid receptor 1
Type:G Protein-Coupled Receptor (GPCR)
Mol. Mass.:52868.96
Organism:Homo sapiens (Human)
Description:P21554
Residue:472
BDBM50181457
NameBDBM50181457
Synonyms:1,3-bis(4-methoxyphenyl)-5-phenyl-2-thioxoimidazolidin-4-one | CHEMBL199914
TypeSmall organic molecule
Emp. Form.C23H20N2O3S
Mol. Mass.404.482
SMILESCOc1ccc(cc1)-n1c(O)c(-c2ccccc2)n(-c2ccc(OC)cc2)c1=S