Reaction Details
TargetCannabinoid receptor 1
LigandBDBM50181461
Substrate/Competitorn/a
Meas. Tech.ChEMBL_330572 (CHEMBL871147)
EC50 1624±n/a nM
Citation Muccioli, GGWouters, JCharlier, CScriba, GKPizza, TDi Pace, PDe Martino, PPoppitz, WPoupaert, JHLambert, DM Synthesis and activity of 1,3,5-triphenylimidazolidine-2,4-diones and 1,3,5-triphenyl-2-thioxoimidazolidin-4-ones: characterization of new CB1 cannabinoid receptor inverse agonists/antagonists. J Med Chem49:872-82 (2006) 
 
Cannabinoid receptor 1
Name:Cannabinoid receptor 1
Type:G Protein-Coupled Receptor (GPCR)
Mol. Mass.:52868.96
Organism:Homo sapiens (Human)
Description:P21554
Residue:472
BDBM50181461
NameBDBM50181461
Synonyms:1,3-bis(4-bromophenyl)-5-phenyl-2-thioxoimidazolidin-4-one | CHEMBL381922
TypeSmall organic molecule
Emp. Form.C21H14Br2N2OS
Mol. Mass.502.222
SMILESOc1c(-c2ccccc2)n(-c2ccc(Br)cc2)c(=S)n1-c1ccc(Br)cc1