Reaction Details
TargetCannabinoid receptor 1
LigandBDBM50181464
Substrate/Competitorn/a
Meas. Tech.ChEMBL_330571 (CHEMBL871146)
Ki>8000±n/a nM
Citation Muccioli, GGWouters, JCharlier, CScriba, GKPizza, TDi Pace, PDe Martino, PPoppitz, WPoupaert, JHLambert, DM Synthesis and activity of 1,3,5-triphenylimidazolidine-2,4-diones and 1,3,5-triphenyl-2-thioxoimidazolidin-4-ones: characterization of new CB1 cannabinoid receptor inverse agonists/antagonists. J Med Chem49:872-82 (2006) 
 
Cannabinoid receptor 1
Name:Cannabinoid receptor 1
Type:G Protein-Coupled Receptor (GPCR)
Mol. Mass.:52868.96
Organism:Homo sapiens (Human)
Description:P21554
Residue:472
BDBM50181464
NameBDBM50181464
Synonyms:1,3,5-triphenyl-2-thioxoimidazolidin-4-one | CHEMBL383249
TypeSmall organic molecule
Emp. Form.C21H16N2OS
Mol. Mass.344.43
SMILESOc1c(-c2ccccc2)n(-c2ccccc2)c(=S)n1-c1ccccc1