Reaction Details
TargetCannabinoid receptor 1
LigandBDBM50181465
Substrate/Competitorn/a
Meas. Tech.ChEMBL_330571 (CHEMBL871146)
Ki 6661±n/a nM
Citation Muccioli, GGWouters, JCharlier, CScriba, GKPizza, TDi Pace, PDe Martino, PPoppitz, WPoupaert, JHLambert, DM Synthesis and activity of 1,3,5-triphenylimidazolidine-2,4-diones and 1,3,5-triphenyl-2-thioxoimidazolidin-4-ones: characterization of new CB1 cannabinoid receptor inverse agonists/antagonists. J Med Chem49:872-82 (2006) 
 
Cannabinoid receptor 1
Name:Cannabinoid receptor 1
Type:G Protein-Coupled Receptor (GPCR)
Mol. Mass.:52868.96
Organism:Homo sapiens (Human)
Description:P21554
Residue:472
BDBM50181465
NameBDBM50181465
Synonyms:5-(4-chlorophenyl)-1,3-diphenylimidazolidine-2,4-dione | CHEMBL383636
TypeSmall organic molecule
Emp. Form.C21H15ClN2O2
Mol. Mass.362.809
SMILESOc1c(-c2ccc(Cl)cc2)n(-c2ccccc2)c(=O)n1-c1ccccc1