Reaction Details
TargetCannabinoid receptor 1
LigandBDBM50181458
Substrate/Competitorn/a
Meas. Tech.ChEMBL_330574 (CHEMBL871152)
Ki 1744±n/a nM
Citation Muccioli, GGWouters, JCharlier, CScriba, GKPizza, TDi Pace, PDe Martino, PPoppitz, WPoupaert, JHLambert, DM Synthesis and activity of 1,3,5-triphenylimidazolidine-2,4-diones and 1,3,5-triphenyl-2-thioxoimidazolidin-4-ones: characterization of new CB1 cannabinoid receptor inverse agonists/antagonists. J Med Chem49:872-82 (2006) 
 
Cannabinoid receptor 1
Name:Cannabinoid receptor 1
Type:G Protein-Coupled Receptor (GPCR)
Mol. Mass.:52856.55
Organism:Rattus norvegicus (rat)
Description:P20272
Residue:473
BDBM50181458
NameBDBM50181458
Synonyms:5-(4-bromophenyl)-1,3-bis(4-chlorophenyl)imidazolidine-2,4-dione | CHEMBL201383
TypeSmall organic molecule
Emp. Form.C21H13BrCl2N2O2
Mol. Mass.476.15
SMILESOc1c(-c2ccc(Br)cc2)n(-c2ccc(Cl)cc2)c(=O)n1-c1ccc(Cl)cc1