Reaction Details
TargetMitogen-activated protein kinase 8
LigandBDBM50181532
Substrate/Competitorn/a
Meas. Tech.ChEMBL_330898 (CHEMBL862110)
IC50>100000±n/a nM
Citation Jung, FHPasquet, GLambert-van der Brempt, CLohmann, JJWarin, NRenaud, FGermain, HDe Savi, CRoberts, NJohnson, TDousson, CHill, GBMortlock, AAHeron, NWilkinson, RWWedge, SRHeaton, SPOdedra, RKeen, NJGreen, SBrown, EThompson, KBrightwell, S Discovery of novel and potent thiazoloquinazolines as selective Aurora A and B kinase inhibitors. J Med Chem49:955-70 (2006) 
 
Mitogen-activated protein kinase 8
Name:Mitogen-activated protein kinase 8
Type:Enzyme
Mol. Mass.:48297.57
Organism:Homo sapiens (Human)
Description:JNK-1 was purchased from Upstate Cell Signaling Solutions (formerly Upstate Biotechnology).
Residue:427
BDBM50181532
NameBDBM50181532
Synonyms:CHEMBL201307 N-(3-fluorophenyl)-2-{2-[(7-{3-[4-(hydroxymethyl)piperidin-1-yl]propoxy}-6-methoxyquinazolin-4-yl)amino]-1,3-thiazol-5-yl}acetamide | N-3-fluorophenyl)-2-2-7-3-4-hydroxymethyl)piperidin-1-yl)propoxy)-6-methoxyquinazolin-4-ylamino)thiazol-5-yl)acetamide
TypeSmall organic molecule
Emp. Form.C29H33FN6O4S
Mol. Mass.580.674
SMILESCOc1cc2c(Nc3ncc(CC(=O)Nc4cccc(F)c4)s3)ncnc2cc1OCCCN1CCC(CO)CC1