Reaction Details
TargetEstrogen receptor beta
LigandBDBM50181362
Substrate/Competitorn/a
Meas. Tech.ChEMBL_331402 (CHEMBL867044)
Ki 0.5±n/a nM
Citation Wallace, OBLauwers, KSDodge, JAMay, SACalvin, JRHinklin, RBryant, HUShetler, PKAdrian, MDGeiser, AGSato, MBurris, TP A selective estrogen receptor modulator for the treatment of hot flushes. J Med Chem49:843-6 (2006) 
 
Estrogen receptor beta
Name:Estrogen receptor beta
Type:Protein
Mol. Mass.:59238.43
Organism:Homo sapiens (Human)
Description:Q92731
Residue:530
BDBM50181362
NameBDBM50181362
Synonyms:(R)-(+)-7,9-difluoro-5-[4-(2-piperidin-1-ylethoxy)phenyl]-5H-6-oxachrysen-2-ol hydrochloride | CHEMBL535158
TypeSmall organic molecule
Emp. Form.C30H27F2NO3
Mol. Mass.487.5371
SMILESOc1ccc2c3[C@H](Oc4c(F)cc(F)cc4-c3ccc2c1)c1ccc(OCCN2CCCCC2)cc1