Reaction Details
Target5-hydroxytryptamine receptor 4
LigandBDBM50181845
Substrate/Competitorn/a
Meas. Tech.ChEMBL_332071 (CHEMBL859603)
Ki 0.350000±n/a nM
Citation Becker, DPFlynn, DLMoormann, AENosal, RVillamil, CILoeffler, RGullikson, GWMoummi, CYang, DC Pyrrolizidine esters and amides as 5-HT4 receptor agonists and antagonists. J Med Chem49:1125-39 (2006) 
 
5-hydroxytryptamine receptor 4
Name:5-hydroxytryptamine receptor 4
Type:Enzyme Catalytic Domain
Mol. Mass.:43735.29
Organism:GUINEA PIG
Description:5-HT4 HTR4 GUINEA PIG::O70528
Residue:388
BDBM50181845
NameBDBM50181845
Synonyms:(1S,7aS)-1-{[(4-amino-5-chloro-2-methoxybenzoyl)amino]methyl}-4-methylhexahydro-1H-pyrrolizinium, iodide | CHEMBL199866
TypeSmall organic molecule
Emp. Form.C17H25ClN3O2
Mol. Mass.338.852
SMILESCOc1cc(N)c(Cl)cc1C(=O)NC[C@@H]1CC[N@@+]2(C)CCC[C@@H]12