Reaction Details
TargetEstrogen receptor
LigandBDBM50178322
Substrate/Competitorn/a
Meas. Tech.ChEMBL_332769 (CHEMBL865276)
IC50>1000±n/a nM
Citation Blizzard, TAGude, CMorgan, JDChan, WBirzin, ETMojena, MTudela, CChen, FKnecht, KSu, QKraker, BMosley, RTHolmes, MASharma, NFitzgerald, PMRohrer, SPHammond, ML Androstenediol analogs as ER-beta-selective SERMs. Bioorg Med Chem Lett16:834-8 (2006) 
 
Estrogen receptor
Name:Estrogen receptor
Type:Protein
Mol. Mass.:66230.44
Organism:Homo sapiens (Human)
Description:P03372
Residue:595
BDBM50178322
NameBDBM50178322
Synonyms:2-((3S,10S,13S,17S)-3,17-dihydroxy-13-methyl-2,3,4,7,8,9,10,11,12,13,14,15,16,17-tetradecahydro-1H-cyclopenta[a]phenanthren-10-yl)acetaldehyde | CHEMBL201364
TypeSmall organic molecule
Emp. Form.C20H30O3
Mol. Mass.318.4504
SMILESC[C@]12CCC3C(CC=C4C[C@@H](O)CC[C@]34CC=O)C1CC[C@@H]2O