Reaction Details
TargetAndrogen receptor
LigandBDBM50178323
Substrate/Competitorn/a
Meas. Tech.ChEMBL_332775 (CHEMBL859226)
IC50 212±n/a nM
Citation Blizzard, TAGude, CMorgan, JDChan, WBirzin, ETMojena, MTudela, CChen, FKnecht, KSu, QKraker, BMosley, RTHolmes, MASharma, NFitzgerald, PMRohrer, SPHammond, ML Androstenediol analogs as ER-beta-selective SERMs. Bioorg Med Chem Lett16:834-8 (2006) 
 
Androgen receptor
Name:Androgen receptor
Type:Receptor
Mol. Mass.:99185.27
Organism:Homo sapiens (Human)
Description:CHO cells were stably transfected with human AR gene.
Residue:920
BDBM50178323
NameBDBM50178323
Synonyms:(3S,10R,13S,17S)-10,13-Dimethyl-2,3,4,7,8,9,10,11,12,13,14,15,16,17-tetradecahydro-1H-cyclopenta[a]phenanthrene-3,17-diol | CHEMBL77135
TypeSmall organic molecule
Emp. Form.C19H30O2
Mol. Mass.290.4403
SMILESC[C@]12CCC3C(CC=C4C[C@@H](O)CC[C@]34C)C1CC[C@@H]2O