Reaction Details
TargetAndrogen receptor
LigandBDBM50178314
Substrate/Competitorn/a
Meas. Tech.ChEMBL_332775 (CHEMBL859226)
IC50 33±n/a nM
Citation Blizzard, TAGude, CMorgan, JDChan, WBirzin, ETMojena, MTudela, CChen, FKnecht, KSu, QKraker, BMosley, RTHolmes, MASharma, NFitzgerald, PMRohrer, SPHammond, ML Androstenediol analogs as ER-beta-selective SERMs. Bioorg Med Chem Lett16:834-8 (2006) 
 
Androgen receptor
Name:Androgen receptor
Type:Receptor
Mol. Mass.:99185.27
Organism:Homo sapiens (Human)
Description:CHO cells were stably transfected with human AR gene.
Residue:920
BDBM50178314
NameBDBM50178314
Synonyms:(3S,10S,13S,17S)-13-methyl-10-vinyl-2,3,4,7,8,9,10,11,12,13,14,15,16,17-tetradecahydro-1H-cyclopenta[a]phenanthrene-3,17-diol | CHEMBL373019
TypeSmall organic molecule
Emp. Form.C20H30O2
Mol. Mass.302.451
SMILESC[C@]12CCC3C(CC=C4C[C@@H](O)CC[C@]34C=C)C1CC[C@@H]2O