Reaction Details
TargetVasopressin V2 receptor
LigandBDBM50177599
Substrate/Competitorn/a
Meas. Tech.ChEMBL_334042 (CHEMBL862402)
IC50 91.5±n/a nM
Citation Failli, AAShumsky, JSSteffan, RJCaggiano, TJWilliams, DKTrybulski, EJNing, XLock, YTanikella, THartmann, DChan, PSPark, CH Pyridobenzodiazepines: a novel class of orally active, vasopressin V2 receptor selective agonists. Bioorg Med Chem Lett16:954-9 (2006) 
 
Vasopressin V2 receptor
Name:Vasopressin V2 receptor
Type:Receptor
Mol. Mass.:40295.28
Organism:Homo sapiens (Human)
Description:P30518
Residue:371
BDBM50177599
NameBDBM50177599
Synonyms:CHEMBL202447 | [2-chloro-4-(3-methyl-pyrazol-1-yl)-phenyl]-(5,11-dihydro-benzo[b]pyrido[2,3-e][1,4]diazepin-6-yl)-methanone
TypeSmall organic molecule
Emp. Form.C23H18ClN5O
Mol. Mass.415.875
SMILESCc1ccn(n1)-c1ccc(C(=O)N2Cc3cccnc3Nc3ccccc23)c(Cl)c1