Reaction Details
TargetDNA polymerase III PolC-type
LigandBDBM50182658
Substrate/Competitorn/a
Meas. Tech.ChEMBL_334242 (CHEMBL861887)
Ki 41±n/a nM
Citation Zhi, CLong, ZYManikowski, AComstock, JXu, WCBrown, NCTarantino, PMHolm, KADix, EJWright, GEBarnes, MHButler, MMFoster, KALaMarr, WABachand, BBethell, RCadilhac, CCharron, SLamothe, SMotorina, IStorer, R Hybrid antibacterials. DNA polymerase-topoisomerase inhibitors. J Med Chem49:1455-65 (2006) 
 
DNA polymerase III PolC-type
Name:DNA polymerase III PolC-type
Type:Enzyme
Mol. Mass.:162625.67
Organism:Bacillus subtilis
Description:Enzyme was purified from recombinant strains.
Residue:1437
BDBM50182658
NameBDBM50182658
Synonyms:3-{5-[1-(1-cyclopropyl-3-carboxy-6-fluoro-4-oxo-7-quinolyl)-3-(1,3-diazabicyclononyl)]pentyl}-6-(3-ethyl-4-methylanilino)-uracil | CHEMBL203701
TypeSmall organic molecule
Emp. Form.C38H45FN6O5
Mol. Mass.684.7995
SMILESCCc1cc(Nc2cc(=O)n(CCCCCN3CC4CCCN(C4C3)c3cc4n(cc(C(O)=O)c(=O)c4cc3F)C3CC3)c(=O)[nH]2)ccc1C