Reaction Details
TargetDNA polymerase III PolC-type
LigandBDBM21688
Substrate/Competitorn/a
Meas. Tech.ChEMBL_334242 (CHEMBL861887)
Ki 19±n/a nM
Citation Zhi, CLong, ZYManikowski, AComstock, JXu, WCBrown, NCTarantino, PMHolm, KADix, EJWright, GEBarnes, MHButler, MMFoster, KALaMarr, WABachand, BBethell, RCadilhac, CCharron, SLamothe, SMotorina, IStorer, R Hybrid antibacterials. DNA polymerase-topoisomerase inhibitors. J Med Chem49:1455-65 (2006) 
 
DNA polymerase III PolC-type
Name:DNA polymerase III PolC-type
Type:Enzyme
Mol. Mass.:162625.67
Organism:Bacillus subtilis
Description:Enzyme was purified from recombinant strains.
Residue:1437
BDBM21688
NameBDBM21688
Synonyms:1-cyclopropyl-7-[4-(4-{4-[(3-ethyl-4-methylphenyl)amino]-2,6-dioxo-1,2,3,6-tetrahydropyrimidin-1-yl}butyl)-3-methylpiperazin-1-yl]-6,8-difluoro-4-oxo-1,4-dihydroquinoline-3-carboxylic acid 251D | CHEMBL201900
TypeSmall organic molecule
Emp. Form.C35H40F2N6O5
Mol. Mass.662.7261
SMILESCCc1cc(Nc2cc(=O)n(CCCCN3CCN(CC3C)c3c(F)cc4c(c3F)n(cc(C(O)=O)c4=O)C3CC3)c(=O)[nH]2)ccc1C