Reaction Details
TargetDNA polymerase III PolC-type
LigandBDBM50182673
Substrate/Competitorn/a
Meas. Tech.ChEMBL_334242 (CHEMBL861887)
Ki 17±n/a nM
Citation Zhi, CLong, ZYManikowski, AComstock, JXu, WCBrown, NCTarantino, PMHolm, KADix, EJWright, GEBarnes, MHButler, MMFoster, KALaMarr, WABachand, BBethell, RCadilhac, CCharron, SLamothe, SMotorina, IStorer, R Hybrid antibacterials. DNA polymerase-topoisomerase inhibitors. J Med Chem49:1455-65 (2006) 
 
DNA polymerase III PolC-type
Name:DNA polymerase III PolC-type
Type:Enzyme
Mol. Mass.:162625.67
Organism:Bacillus subtilis
Description:Enzyme was purified from recombinant strains.
Residue:1437
BDBM50182673
NameBDBM50182673
Synonyms:3-{4-[1-(1-(4-fluorophenyl)-3-carboxy-4-oxo-6-fluoro-7-quinolyl)-4-piperazinyl]butyl}-6-(3-ethyl-4-methylanilino)uracil | CHEMBL202801
TypeSmall organic molecule
Emp. Form.C37H38F2N6O5
Mol. Mass.684.7316
SMILESCCc1cc(Nc2cc(=O)n(CCCCN3CCN(CC3)c3cc4n(cc(C(O)=O)c(=O)c4cc3F)-c3ccc(F)cc3)c(=O)[nH]2)ccc1C