Reaction Details
TargetDelta-type opioid receptor
LigandBDBM50183557
Substrate/Competitorn/a
Meas. Tech.ChEMBL_335164 (CHEMBL861286)
Ki 23±n/a nM
Citation Lee, YSAgnes, RSBadghisi, HDavis, PMa, SWLai, JPorreca, FHruby, VJ Design and synthesis of novel hydrazide-linked bifunctional peptides as delta/mu opioid receptor agonists and CCK-1/CCK-2 receptor antagonists. J Med Chem49:1773-80 (2006) 
 
Delta-type opioid receptor
Name:Delta-type opioid receptor
Type:G Protein-Coupled Receptor (GPCR)
Mol. Mass.:40382.98
Organism:Homo sapiens (Human)
Description:Competition binding assays were carried out using membrane preparations from transfected HN9.10 cells that constitutively expressed the delta opioid receptor.
Residue:372
BDBM50183557
NameBDBM50183557
Synonyms:CHEMBL442483 | H-Tyr-D-Ala-Gly-Phe-NH-NH-Phe-Asp-Nle-Trp-Ac
TypeSmall organic molecule
Emp. Form.C55H65N9O14
Mol. Mass.1076.1565
SMILESCCCC[C@H](NC(=O)[C@H](CC(O)=O)NC(=O)[C@H](Cc1ccccc1)NN[C@@H](Cc1ccccc1)C(=O)NCC(=O)N[C@H](C)C(=O)N[C@@H](Cc1ccc(O)cc1)C(O)=O)C(=O)N[C@@H](Cc1cn(C(C)=O)c2ccccc12)C(O)=O