Reaction Details
TargetMu-type opioid receptor
LigandBDBM50183559
Substrate/Competitorn/a
Meas. Tech.ChEMBL_335165 (CHEMBL861287)
Ki 20±n/a nM
Citation Lee, YSAgnes, RSBadghisi, HDavis, PMa, SWLai, JPorreca, FHruby, VJ Design and synthesis of novel hydrazide-linked bifunctional peptides as delta/mu opioid receptor agonists and CCK-1/CCK-2 receptor antagonists. J Med Chem49:1773-80 (2006) 
 
Mu-type opioid receptor
Name:Mu-type opioid receptor
Type:G Protein-Coupled Receptor (GPCR)
Mol. Mass.:44503.11
Organism:Rattus norvegicus (rat)
Description:Competition binding assays were carried out using membrane preparations from transfected HN9.10 cells that constitutively expressed the mu opioid receptor.
Residue:398
BDBM50183559
NameBDBM50183559
Synonyms:CHEMBL374325 | Tyr-D-Ala-Gly-Phe-NH-NH-Phe-Asp-NMeNle-D-Trp-Boc
TypeSmall organic molecule
Emp. Form.C59H73N9O15
Mol. Mass.1148.2622
SMILESCCCC[C@H](N(C)C(=O)[C@H](CC(O)=O)NC(=O)[C@H](Cc1ccccc1)NN[C@@H](Cc1ccccc1)C(=O)NCC(=O)N[C@H](C)C(=O)N[C@@H](Cc1ccc(O)cc1)C(O)=O)C(=O)N[C@H](Cc1cn(C(=O)OC(C)(C)C)c2ccccc12)C(O)=O