Reaction Details
TargetMu-type opioid receptor
LigandBDBM50183556
Substrate/Competitorn/a
Meas. Tech.ChEMBL_335165 (CHEMBL861287)
Ki 5.3±n/a nM
Citation Lee, YSAgnes, RSBadghisi, HDavis, PMa, SWLai, JPorreca, FHruby, VJ Design and synthesis of novel hydrazide-linked bifunctional peptides as delta/mu opioid receptor agonists and CCK-1/CCK-2 receptor antagonists. J Med Chem49:1773-80 (2006) 
 
Mu-type opioid receptor
Name:Mu-type opioid receptor
Type:G Protein-Coupled Receptor (GPCR)
Mol. Mass.:44503.11
Organism:Rattus norvegicus (rat)
Description:Competition binding assays were carried out using membrane preparations from transfected HN9.10 cells that constitutively expressed the mu opioid receptor.
Residue:398
BDBM50183556
NameBDBM50183556
Synonyms:CHEMBL408889 | H-Tyr-D-Ala-Gly-Phe-NH-NH-(NMe)Phe-Asp-Nle-Trp-Ac
TypeSmall organic molecule
Emp. Form.C56H67N9O14
Mol. Mass.1090.1831
SMILESCCCC[C@H](NC(=O)[C@H](CC(O)=O)NC(=O)[C@H](Cc1ccccc1)N(C)N[C@@H](Cc1ccccc1)C(=O)NCC(=O)N[C@H](C)C(=O)N[C@@H](Cc1ccc(O)cc1)C(O)=O)C(=O)N[C@@H](Cc1cn(C(C)=O)c2ccccc12)C(O)=O