Reaction Details
TargetCytochrome P450 2D6
LigandBDBM50185242
Substrate/Competitorn/a
Meas. Tech.ChEMBL_343532 (CHEMBL860702)
IC50>400000±n/a nM
Citation de Graaf, COostenbrink, CKeizers, PHvan der Wijst, TJongejan, AVermeulen, NP Catalytic site prediction and virtual screening of cytochrome P450 2D6 substrates by consideration of water and rescoring in automated docking. J Med Chem49:2417-30 (2006) 
 
Cytochrome P450 2D6
Name:Cytochrome P450 2D6
Type:Protein
Mol. Mass.:55774.82
Organism:Homo sapiens (Human)
Description:P10635
Residue:497
BDBM50185242
NameBDBM50185242
Synonyms:10,11-dihydro-5H-benzo[4,5]cyclohepta[1,2-b]pyridin-5-one O-propionyloxime | CHEMBL381552
TypeSmall organic molecule
Emp. Form.C17H16N2O2
Mol. Mass.280.3211
SMILESCCC(=O)ON=C1c2ccccc2CCc2ncccc12