Reaction Details
TargetCytochrome P450 2D6
LigandBDBM50185254
Substrate/Competitorn/a
Meas. Tech.ChEMBL_343532 (CHEMBL860702)
IC50 150±n/a nM
Citation de Graaf, COostenbrink, CKeizers, PHvan der Wijst, TJongejan, AVermeulen, NP Catalytic site prediction and virtual screening of cytochrome P450 2D6 substrates by consideration of water and rescoring in automated docking. J Med Chem49:2417-30 (2006) 
 
Cytochrome P450 2D6
Name:Cytochrome P450 2D6
Type:Protein
Mol. Mass.:55774.82
Organism:Homo sapiens (Human)
Description:P10635
Residue:497
BDBM50185254
NameBDBM50185254
Synonyms:BS 7581 | CHEMBL444541
TypeSmall organic molecule
Emp. Form.C26H27N
Mol. Mass.353.4993
SMILESCC(Cc1ccccc1)NC1CC2c3c1cccc3CCc1ccccc21