Reaction Details
TargetPeroxisome proliferator-activated receptor alpha
LigandBDBM28700
Substrate/Competitorn/a
Meas. Tech.ChEMBL_360810 (CHEMBL866368)
EC50 9200±n/a nM
Citation Kainuma, MKasuga, JHosoda, SWakabayashi, KTanatani, ANagasawa, KMiyachi, HMakishima, MHashimoto, Y Diphenylmethane skeleton as a multi-template for nuclear receptor ligands: preparation of FXR and PPAR ligands. Bioorg Med Chem Lett16:3213-8 (2006) 
 
Peroxisome proliferator-activated receptor alpha
Name:Peroxisome proliferator-activated receptor alpha
Type:Enzyme
Mol. Mass.:52222.08
Organism:Homo sapiens (Human)
Description:Q07869
Residue:468
BDBM28700
NameBDBM28700
Synonyms:2-(4-(4-Chlorobenzoyl)phenoxy)-2-methylpropionic acid CHEMBL981 FIBRICOR LF 153 procetofenic acid
TypeSmall organic molecule
Emp. Form.C17H15ClO4
Mol. Mass.318.752
SMILESCC(C)(Oc1ccc(cc1)C(=O)c1ccc(Cl)cc1)C(O)=O