Reaction Details
Target3-hydroxyacyl-[acyl-carrier-protein] dehydratase
LigandBDBM7459
Substrate/Competitorn/a
Meas. Tech.ChEMBL_361103 (CHEMBL859169)
Ki 11500±n/a nM
Citation Tasdemir, DLack, GBrun, RRüedi, PScapozza, LPerozzo, R Inhibition of Plasmodium falciparum fatty acid biosynthesis: evaluation of FabG, FabZ, and FabI as drug targets for flavonoids. J Med Chem49:3345-53 (2006) 
 
3-hydroxyacyl-[acyl-carrier-protein] dehydratase
Name:3-hydroxyacyl-[acyl-carrier-protein] dehydratase
Synonyms:Fatty acid synthase
Type:PROTEIN
Mol. Mass.:26222.50
Organism:Plasmodium falciparum
Description:ChEMBL_983601
Residue:230
BDBM7459
NameBDBM7459
TypeSmall organic molecule
Emp. Form.C15H10O6
Mol. Mass.286.2363
SMILESOc1cc(O)c2c(c1)oc(cc2=O)-c1ccc(O)c(O)c1