Reaction Details
Target3-oxoacyl-acyl-carrier protein reductase
LigandBDBM26658
Substrate/Competitorn/a
Meas. Tech.ChEMBL_361105 (CHEMBL859171)
IC50 2300±n/a nM
Citation Tasdemir, DLack, GBrun, RRüedi, PScapozza, LPerozzo, R Inhibition of Plasmodium falciparum fatty acid biosynthesis: evaluation of FabG, FabZ, and FabI as drug targets for flavonoids. J Med Chem49:3345-53 (2006) 
 
3-oxoacyl-acyl-carrier protein reductase
Name:3-oxoacyl-acyl-carrier protein reductase
Synonyms:n/a
Type:PROTEIN
Mol. Mass.:33333.53
Organism:Plasmodium falciparum
Description:ChEMBL_675156
Residue:301
BDBM26658
NameBDBM26658
TypeFlavonoid
Emp. Form.C15H10O7
Mol. Mass.302.2357
SMILESOc1ccc(c(O)c1)-c1oc2cc(O)cc(O)c2c(=O)c1O