Reaction Details
TargetSolute carrier family 15 member 1
LigandBDBM50188483
Substrate/Competitorn/a
Meas. Tech.ChEMBL_363879 (CHEMBL863210)
EC50 320000±n/a nM
Citation Vig, BSStouch, TRTimoszyk, JKQuan, YWall, DASmith, RLFaria, TN Human PEPT1 pharmacophore distinguishes between dipeptide transport and binding. J Med Chem49:3636-44 (2006) 
 
Solute carrier family 15 member 1
Name:Solute carrier family 15 member 1
Type:PROTEIN
Mol. Mass.:78818.07
Organism:Homo sapiens (Human)
Description:ChEMBL_1488839
Residue:708
BDBM50188483
NameBDBM50188483
Synonyms:((S)-2,6-Diamino-hexanoylamino)-acetic acid Lys-Gly
TypeSmall organic molecule
Emp. Form.C8H17N3O3
Mol. Mass.203.2389
SMILESNCCCC[C@H](N)C(=O)NCC(O)=O