Reaction Details
TargetSolute carrier family 15 member 1
LigandBDBM50188490
Substrate/Competitorn/a
Meas. Tech.ChEMBL_363882 (CHEMBL863213)
IC50 1310000±n/a nM
Citation Vig, BSStouch, TRTimoszyk, JKQuan, YWall, DASmith, RLFaria, TN Human PEPT1 pharmacophore distinguishes between dipeptide transport and binding. J Med Chem49:3636-44 (2006) 
 
Solute carrier family 15 member 1
Name:Solute carrier family 15 member 1
Type:PROTEIN
Mol. Mass.:78818.07
Organism:Homo sapiens (Human)
Description:ChEMBL_1488839
Residue:708
BDBM50188490
NameBDBM50188490
Synonyms:Asp-Trp | CHEMBL210490
TypeSmall organic molecule
Emp. Form.C15H17N3O5
Mol. Mass.319.3126
SMILESN[C@@H](CC(O)=O)C(=O)N[C@@H](Cc1c[nH]c2ccccc12)C(O)=O