Reaction Details
TargetSolute carrier family 15 member 1
LigandBDBM50188493
Substrate/Competitorn/a
Meas. Tech.ChEMBL_363879 (CHEMBL863210)
EC50 550000±n/a nM
Citation Vig, BSStouch, TRTimoszyk, JKQuan, YWall, DASmith, RLFaria, TN Human PEPT1 pharmacophore distinguishes between dipeptide transport and binding. J Med Chem49:3636-44 (2006) 
 
Solute carrier family 15 member 1
Name:Solute carrier family 15 member 1
Type:PROTEIN
Mol. Mass.:78818.07
Organism:Homo sapiens (Human)
Description:ChEMBL_1488839
Residue:708
BDBM50188493
NameBDBM50188493
Synonyms:(S)-2-(2-Amino-acetylamino)-succinic acid Gly-Asp
TypeSmall organic molecule
Emp. Form.C6H10N2O5
Mol. Mass.190.154
SMILESNCC(=O)N[C@@H](CC(O)=O)C(O)=O