Reaction Details
TargetSolute carrier family 15 member 1
LigandBDBM50188497
Substrate/Competitorn/a
Meas. Tech.ChEMBL_363882 (CHEMBL863213)
IC50 950000±n/a nM
Citation Vig, BSStouch, TRTimoszyk, JKQuan, YWall, DASmith, RLFaria, TN Human PEPT1 pharmacophore distinguishes between dipeptide transport and binding. J Med Chem49:3636-44 (2006) 
 
Solute carrier family 15 member 1
Name:Solute carrier family 15 member 1
Type:PROTEIN
Mol. Mass.:78818.07
Organism:Homo sapiens (Human)
Description:ChEMBL_1488839
Residue:708
BDBM50188497
NameBDBM50188497
Synonyms:CHEMBL209765 | His-Trp
TypeSmall organic molecule
Emp. Form.C17H19N5O3
Mol. Mass.341.3645
SMILESN[C@@H](Cc1cnc[nH]1)C(=O)N[C@@H](Cc1c[nH]c2ccccc12)C(O)=O