Reaction Details
TargetSolute carrier family 15 member 1
LigandBDBM50188499
Substrate/Competitorn/a
Meas. Tech.ChEMBL_363879 (CHEMBL863210)
EC50 330000±n/a nM
Citation Vig, BSStouch, TRTimoszyk, JKQuan, YWall, DASmith, RLFaria, TN Human PEPT1 pharmacophore distinguishes between dipeptide transport and binding. J Med Chem49:3636-44 (2006) 
 
Solute carrier family 15 member 1
Name:Solute carrier family 15 member 1
Type:PROTEIN
Mol. Mass.:78818.07
Organism:Homo sapiens (Human)
Description:ChEMBL_1488839
Residue:708
BDBM50188499
NameBDBM50188499
Synonyms:(S)-2-(2-Amino-acetylamino)-3-(1H-indol-3-yl)-propionic acid 2-(2-Amino-acetylamino)-3-(1H-indol-3-yl)-propionic acid Gly-Trp
TypeSmall organic molecule
Emp. Form.C13H15N3O3
Mol. Mass.261.2765
SMILESNCC(=O)N[C@@H](Cc1c[nH]c2ccccc12)C(O)=O