Reaction Details
TargetSolute carrier family 15 member 1
LigandBDBM50188501
Substrate/Competitorn/a
Meas. Tech.ChEMBL_363879 (CHEMBL863210)
EC50 250000±n/a nM
Citation Vig, BSStouch, TRTimoszyk, JKQuan, YWall, DASmith, RLFaria, TN Human PEPT1 pharmacophore distinguishes between dipeptide transport and binding. J Med Chem49:3636-44 (2006) 
 
Solute carrier family 15 member 1
Name:Solute carrier family 15 member 1
Type:PROTEIN
Mol. Mass.:78818.07
Organism:Homo sapiens (Human)
Description:ChEMBL_1488839
Residue:708
BDBM50188501
NameBDBM50188501
Synonyms:(S)-4-Methyl-2-[((S)-pyrrolidine-2-carbonyl)-amino]-pentanoic acid CHEMBL293494 | Pro-Leu
TypeSmall organic molecule
Emp. Form.C11H20N2O3
Mol. Mass.228.2881
SMILESCC(C)C[C@H](NC(=O)[C@@H]1CCCN1)C(O)=O