Reaction Details
TargetSolute carrier family 15 member 1
LigandBDBM50188506
Substrate/Competitorn/a
Meas. Tech.ChEMBL_363879 (CHEMBL863210)
EC50 210000±n/a nM
Citation Vig, BSStouch, TRTimoszyk, JKQuan, YWall, DASmith, RLFaria, TN Human PEPT1 pharmacophore distinguishes between dipeptide transport and binding. J Med Chem49:3636-44 (2006) 
 
Solute carrier family 15 member 1
Name:Solute carrier family 15 member 1
Type:PROTEIN
Mol. Mass.:78818.07
Organism:Homo sapiens (Human)
Description:ChEMBL_1488839
Residue:708
BDBM50188506
NameBDBM50188506
Synonyms:CHEMBL380174 | Val-Val-Val
TypeSmall organic molecule
Emp. Form.C15H29N3O4
Mol. Mass.315.4085
SMILESCC(C)[C@H](N)C(=O)N[C@@H](C(C)C)C(=O)N[C@@H](C(C)C)C(O)=O