Reaction Details
TargetSolute carrier family 15 member 1
LigandBDBM50188512
Substrate/Competitorn/a
Meas. Tech.ChEMBL_363882 (CHEMBL863213)
IC50 10900000±n/a nM
Citation Vig, BSStouch, TRTimoszyk, JKQuan, YWall, DASmith, RLFaria, TN Human PEPT1 pharmacophore distinguishes between dipeptide transport and binding. J Med Chem49:3636-44 (2006) 
 
Solute carrier family 15 member 1
Name:Solute carrier family 15 member 1
Type:PROTEIN
Mol. Mass.:78818.07
Organism:Homo sapiens (Human)
Description:ChEMBL_1488839
Residue:708
BDBM50188512
NameBDBM50188512
Synonyms:CHEMBL379332 | Lys-Lys
TypeSmall organic molecule
Emp. Form.C12H26N4O3
Mol. Mass.274.3598
SMILESNCCCC[C@H](N)C(=O)N[C@@H](CCCCN)C(O)=O