Reaction Details
TargetSolute carrier family 15 member 1
LigandBDBM50169189
Substrate/Competitorn/a
Meas. Tech.ChEMBL_363882 (CHEMBL863213)
IC50 330000±n/a nM
Citation Vig, BSStouch, TRTimoszyk, JKQuan, YWall, DASmith, RLFaria, TN Human PEPT1 pharmacophore distinguishes between dipeptide transport and binding. J Med Chem49:3636-44 (2006) 
 
Solute carrier family 15 member 1
Name:Solute carrier family 15 member 1
Type:PROTEIN
Mol. Mass.:78818.07
Organism:Homo sapiens (Human)
Description:ChEMBL_1488839
Residue:708
BDBM50169189
NameBDBM50169189
Synonyms:(S)-1-(2-Amino-acetyl)-pyrrolidine-2-carboxylic acid CHEMBL80548 | Gly-Pro
TypeSmall organic molecule
Emp. Form.C7H12N2O3
Mol. Mass.172.1818
SMILESNCC(=O)N1CCC[C@H]1C(O)=O