Reaction Details
TargetSolute carrier family 15 member 1
LigandBDBM50188521
Substrate/Competitorn/a
Meas. Tech.ChEMBL_363879 (CHEMBL863210)
EC50 70000±n/a nM
Citation Vig, BSStouch, TRTimoszyk, JKQuan, YWall, DASmith, RLFaria, TN Human PEPT1 pharmacophore distinguishes between dipeptide transport and binding. J Med Chem49:3636-44 (2006) 
 
Solute carrier family 15 member 1
Name:Solute carrier family 15 member 1
Type:PROTEIN
Mol. Mass.:78818.07
Organism:Homo sapiens (Human)
Description:ChEMBL_1488839
Residue:708
BDBM50188521
NameBDBM50188521
Synonyms:(S)-2-((S)-2-Amino-3-methyl-butyrylamino)-3-methyl-butyric acid CHEMBL54552 | Val-Val
TypeSmall organic molecule
Emp. Form.C10H20N2O3
Mol. Mass.216.2774
SMILESCC(C)[C@H](N)C(=O)N[C@@H](C(C)C)C(O)=O