Reaction Details
TargetSolute carrier family 15 member 1
LigandBDBM50169114
Substrate/Competitorn/a
Meas. Tech.ChEMBL_363882 (CHEMBL863213)
IC50 12300000±n/a nM
Citation Vig, BSStouch, TRTimoszyk, JKQuan, YWall, DASmith, RLFaria, TN Human PEPT1 pharmacophore distinguishes between dipeptide transport and binding. J Med Chem49:3636-44 (2006) 
 
Solute carrier family 15 member 1
Name:Solute carrier family 15 member 1
Type:PROTEIN
Mol. Mass.:78818.07
Organism:Homo sapiens (Human)
Description:ChEMBL_1488839
Residue:708
BDBM50169114
NameBDBM50169114
Synonyms:CHEMBL190027 | Pro-Glu
TypeSmall organic molecule
Emp. Form.C10H16N2O5
Mol. Mass.244.2444
SMILESOC(=O)CC[C@H](NC(=O)[C@@H]1CCCN1)C(O)=O