Reaction Details
TargetSolute carrier family 15 member 1
LigandBDBM50169222
Substrate/Competitorn/a
Meas. Tech.ChEMBL_363882 (CHEMBL863213)
IC50 820000±n/a nM
Citation Vig, BSStouch, TRTimoszyk, JKQuan, YWall, DASmith, RLFaria, TN Human PEPT1 pharmacophore distinguishes between dipeptide transport and binding. J Med Chem49:3636-44 (2006) 
 
Solute carrier family 15 member 1
Name:Solute carrier family 15 member 1
Type:PROTEIN
Mol. Mass.:78818.07
Organism:Homo sapiens (Human)
Description:ChEMBL_1488839
Residue:708
BDBM50169222
NameBDBM50169222
Synonyms:2-(aminoacetamido)acetic acid Gly-Gly N-glycylglycine glycine dipeptide | glycylglycine
TypeSmall organic molecule
Emp. Form.C4H8N2O3
Mol. Mass.132.1179
SMILESNCC(=O)NCC(O)=O