Reaction Details
TargetSolute carrier family 15 member 1
LigandBDBM50188513
Substrate/Competitorn/a
Meas. Tech.ChEMBL_363879 (CHEMBL863210)
EC50 750000±n/a nM
Citation Vig, BSStouch, TRTimoszyk, JKQuan, YWall, DASmith, RLFaria, TN Human PEPT1 pharmacophore distinguishes between dipeptide transport and binding. J Med Chem49:3636-44 (2006) 
 
Solute carrier family 15 member 1
Name:Solute carrier family 15 member 1
Type:PROTEIN
Mol. Mass.:78818.07
Organism:Homo sapiens (Human)
Description:ChEMBL_1488839
Residue:708
BDBM50188513
NameBDBM50188513
Synonyms:(S)-6-Amino-2-(2-amino-acetylamino)-hexanoic acid Gly-Lys
TypeSmall organic molecule
Emp. Form.C8H17N3O3
Mol. Mass.203.2389
SMILESNCCCC[C@H](NC(=O)CN)C(O)=O