Reaction Details
TargetSolute carrier family 15 member 1
LigandBDBM50188525
Substrate/Competitorn/a
Meas. Tech.ChEMBL_363879 (CHEMBL863210)
EC50 280000±n/a nM
Citation Vig, BSStouch, TRTimoszyk, JKQuan, YWall, DASmith, RLFaria, TN Human PEPT1 pharmacophore distinguishes between dipeptide transport and binding. J Med Chem49:3636-44 (2006) 
 
Solute carrier family 15 member 1
Name:Solute carrier family 15 member 1
Type:PROTEIN
Mol. Mass.:78818.07
Organism:Homo sapiens (Human)
Description:ChEMBL_1488839
Residue:708
BDBM50188525
NameBDBM50188525
Synonyms:CHEMBL209670 | Gly-Leu-Phe
TypeSmall organic molecule
Emp. Form.C17H25N3O4
Mol. Mass.335.3981
SMILESCC(C)C[C@H](NC(=O)CN)C(=O)N[C@@H](Cc1ccccc1)C(O)=O