Reaction Details
TargetGlycogen phosphorylase, muscle form
LigandBDBM50346613
Substrate/Competitorn/a
Meas. Tech.ChEMBL_365330 (CHEMBL871240)
IC50 17900±n/a nM
Citation Chen, JLiu, JZhang, LWu, GHua, WWu, XSun, H Pentacyclic triterpenes. Part 3: Synthesis and biological evaluation of oleanolic acid derivatives as novel inhibitors of glycogen phosphorylase. Bioorg Med Chem Lett16:2915-9 (2006) 
 
Glycogen phosphorylase, muscle form
Name:Glycogen phosphorylase, muscle form
Type:Enzyme
Mol. Mass.:97296.32
Organism:Oryctolagus cuniculus (rabbit)
Description:Phosphorylation of Ser-15 converts phosphorylase B (unphosphorylated) to phosphorylase A.
Residue:843
BDBM50346613
NameBDBM50346613
Synonyms:CHEMBL470029 | Oleanonic Acid
TypeSmall organic molecule
Emp. Form.C30H46O3
Mol. Mass.454.6844
SMILESCC1(C)CC[C@@]2(CC[C@]3(C)C(=CC[C@@H]4[C@@]5(C)CCC(=O)C(C)(C)[C@@H]5CC[C@@]34C)[C@@H]2C1)C(O)=O