Reaction Details
TargetOrotidine 5'-phosphate decarboxylase
LigandBDBM21340
Substrate/Competitorn/a
Meas. Tech.ChEMBL_381849 (CHEMBL869171)
Ki 12400±n/a nM
Citation Poduch, EBello, AMTang, SFujihashi, MPai, EFKotra, LP Design of inhibitors of orotidine monophosphate decarboxylase using bioisosteric replacement and determination of inhibition kinetics. J Med Chem49:4937-45 (2006) 
 
Orotidine 5'-phosphate decarboxylase
Name:Orotidine 5'-phosphate decarboxylase
Type:Enzyme
Mol. Mass.:24909.45
Organism:Methanobacterium thermoautotrophicum
Description:n/a
Residue:228
BDBM21340
NameBDBM21340
Synonyms:6-aza-UMP {[(2R,3S,4R,5R)-5-(3,5-dioxo-2,3,4,5-tetrahydro-1,2,4-triazin-2-yl)-3,4-dihydroxyoxolan-2-yl]methoxy}phosphonic acid
TypeSmall organic molecule
Emp. Form.C8H12N3O9P
Mol. Mass.325.1693
SMILESO[C@@H]1[C@@H](COP(O)(O)=O)O[C@H]([C@@H]1O)n1ncc(=O)[nH]c1=O